BDBM59569 2-[3-[2-furanyl(oxo)methyl]-4-hydroxy-2-(3-nitrophenyl)-5-oxo-2H-pyrrol-1-yl]-4-methyl-5-thiazolecarboxylic acid ethyl ester::2-[4-(2-furoyl)-3-hydroxy-2-keto-5-(3-nitrophenyl)-3-pyrrolin-1-yl]-4-methyl-thiazole-5-carboxylic acid ethyl ester::MLS001082998::SMR000664801::cid_2909351::ethyl 2-[3-(furan-2-carbonyl)-4-hydroxy-2-(3-nitrophenyl)-5-oxo-2H-pyrrol-1-yl]-4-methyl-1,3-thiazole-5-carboxylate::ethyl 2-[3-(furan-2-ylcarbonyl)-2-(3-nitrophenyl)-4-oxidanyl-5-oxidanylidene-2H-pyrrol-1-yl]-4-methyl-1,3-thiazole-5-carboxylate
SMILES CCOC(=O)c1sc(nc1C)N1C(C(C(=O)c2ccco2)C(=O)C1=O)c1cccc(c1)[N+]([O-])=O
InChI Key InChIKey=JYZLPVPMDCADRR-UHFFFAOYSA-N
Data  3 IC50  1 EC50
  Tab Delimited (TSV)   2D SDfile   Computed 3D by Vconf -m prep SDfile
Find this compound or compounds like it in BindingDB:
Activity Spreadsheet -- Enzyme Inhibition Constant Data from BindingDB
Found 4 hits for monomerid = 59569
TargetNucleotide-binding oligomerization domain-containing protein 1(Homo sapiens (Human))
Burnham Center For Chemical Genomics
Curated by PubChem BioAssay
LigandPNGBDBM59569(2-[3-[2-furanyl(oxo)methyl]-4-hydroxy-2-(3-nitroph...)
Affinity DataEC50:  2.00E+4nM. Assay description: Data Source: Sanford-Burnham Center for Chemical Genomics (SBCCG) Source Affiliation: Sanford-Burnham Medical Research Institute (SBMRI, San Diego, C...
In DepthDetails PCBioAssay
TargetTrans-activator protein BZLF1(Human herpesvirus 4)
The Scripps Research Institute Molecular Screening Center
Curated by PubChem BioAssay
LigandPNGBDBM59569(2-[3-[2-furanyl(oxo)methyl]-4-hydroxy-2-(3-nitroph...)
Affinity DataIC50: >6.70E+4nM. Assay description: Source (MLPCN Center Name): The Scripps Research Institute Molecular Screening Center (SRIMSC) Center Affiliation: The Scripps Research Institute (TS...
In DepthDetails PCBioAssay
TargetMu-type opioid receptor(Homo sapiens (Human))
The Scripps Research Institute Molecular Screening Center
Curated by PubChem BioAssay
LigandPNGBDBM59569(2-[3-[2-furanyl(oxo)methyl]-4-hydroxy-2-(3-nitroph...)
Affinity DataIC50:  1.18E+4nM. Assay description: Source (MLPCN Center Name): The Scripps Research Institute Molecular Screening Center (SRIMSC) Center Affiliation: The Scripps Research Institute (TS...
In DepthDetails PCBioAssay
TargetTumor necrosis factor(Homo sapiens (Human))
Burnham Center For Chemical Genomics
Curated by PubChem BioAssay
LigandPNGBDBM59569(2-[3-[2-furanyl(oxo)methyl]-4-hydroxy-2-(3-nitroph...)
Affinity DataIC50:  2.00E+4nM. Assay description: Data Source: Sanford-Burnham Center for Chemical Genomics (SBCCG) Source Affiliation: Sanford-Burnham Medical Research Institute (SBMRI, San Diego, C...
In DepthDetails PCBioAssay