BDBM60335 3-[(3-keto-4H-1,4-benzoxazin-6-yl)sulfonyl]-N-(2-methylcyclohexyl)propionamide::MLS001116767::N-(2-methylcyclohexyl)-3-[(3-oxidanylidene-4H-1,4-benzoxazin-6-yl)sulfonyl]propanamide::N-(2-methylcyclohexyl)-3-[(3-oxo-4H-1,4-benzoxazin-6-yl)sulfonyl]propanamide::SMR000627481::cid_22551379
SMILES CC1CCCCC1NC(=O)CCS(=O)(=O)c1ccc2OCC(=O)Nc2c1
InChI Key InChIKey=LVFJPYCLWOMLGG-UHFFFAOYSA-N
Data  1 IC50
  Tab Delimited (TSV)   2D SDfile   Computed 3D by Vconf -m prep SDfile
Find this compound or compounds like it in BindingDB:
Activity Spreadsheet -- Enzyme Inhibition Constant Data from BindingDB
Found 1 hit for monomerid = 60335
TargetPlectin(Homo sapiens (Human))
Burnham Center For Chemical Genomics
Curated by PubChem BioAssay
LigandPNGBDBM60335(3-[(3-keto-4H-1,4-benzoxazin-6-yl)sulfonyl]-N-(2-m...)
Affinity DataIC50:  2.00E+5nM. Assay description: Data Source: Sanford-Burnham Center for Chemical Genomics (SBCCG) Source Affiliation: Sanford-Burnham Medical Research Institute (SBMRI, San Diego, C...
Ligand InfoPC cidPC sid
In DepthDetails PCBioAssay