BDBM62576 3-Cyclohexyl-1-cyclopentyl-1-(6,7-dimethoxy-2-oxo-1,2-dihydro-quinolin-3-ylmethyl)-urea::3-cyclohexyl-1-cyclopentyl-1-[(2-keto-6,7-dimethoxy-1H-quinolin-3-yl)methyl]urea::3-cyclohexyl-1-cyclopentyl-1-[(6,7-dimethoxy-2-oxidanylidene-1H-quinolin-3-yl)methyl]urea::3-cyclohexyl-1-cyclopentyl-1-[(6,7-dimethoxy-2-oxo-1H-quinolin-3-yl)methyl]urea::MLS000030624::SMR000004144::cid_655813
SMILES COc1cc2cc(CN(C3CCCC3)C(=O)NC3CCCCC3)c(=O)[nH]c2cc1OC
InChI Key InChIKey=KPIUEZMSZQGAOC-UHFFFAOYSA-N
Data  1 EC50
  Tab Delimited (TSV)   2D SDfile   Computed 3D by Vconf -m prep SDfile
Find this compound or compounds like it in BindingDB:
Activity Spreadsheet -- Enzyme Inhibition Constant Data from BindingDB
Found 1 hit for monomerid = 62576
TargetHeat shock factor protein 1(Mus musculus)
Broad Institute
Curated by PubChem BioAssay
LigandPNGBDBM62576(3-Cyclohexyl-1-cyclopentyl-1-(6,7-dimethoxy-2-oxo-...)
Affinity DataEC50: >1.95E+5nM. Assay description: Keywords: Heat Shock Factor-1 (HSF-1), Stress Response, MG132, NIH3T3, Luminescence Assay Overview: Modified NIH3T3, transformed to express firefly...
In DepthDetails PCBioAssay