BDBM62609 6-(2,3-dihydro-1,4-benzodioxin-6-yl)-1,3-dimethyl-pyrrolo[3,4-d]pyrimidine-2,4-dione::6-(2,3-dihydro-1,4-benzodioxin-6-yl)-1,3-dimethyl-pyrrolo[3,4-d]pyrimidine-2,4-quinone::6-(2,3-dihydro-1,4-benzodioxin-6-yl)-1,3-dimethylpyrrolo[3,4-d]pyrimidine-2,4-dione::MLS000082491::SMR000046364::cid_665179
SMILES Cn1c2cn(cc2c(=O)n(C)c1=O)-c1ccc2OCCOc2c1
InChI Key InChIKey=ZRZBLUDIIPVOCK-UHFFFAOYSA-N
Data  1 EC50
  Tab Delimited (TSV)   2D SDfile   Computed 3D by Vconf -m prep SDfile
Find this compound or compounds like it in BindingDB:
Activity Spreadsheet -- Enzyme Inhibition Constant Data from BindingDB
Found 1 hit for monomerid = 62609
TargetHeat shock factor protein 1(Mus musculus)
Broad Institute
Curated by PubChem BioAssay
LigandPNGBDBM62609(6-(2,3-dihydro-1,4-benzodioxin-6-yl)-1,3-dimethyl-...)
Affinity DataEC50: >1.95E+5nM. Assay description: Keywords: Heat Shock Factor-1 (HSF-1), Stress Response, MG132, NIH3T3, Luminescence Assay Overview: Modified NIH3T3, transformed to express firefly...
In DepthDetails PCBioAssay