BDBM64576 (3Z)-5-ethyl-3-(2-oxidanylidene-2-thiophen-2-yl-ethylidene)-1H-indol-2-one::(3Z)-5-ethyl-3-(2-oxo-2-thiophen-2-ylethylidene)-1H-indol-2-one::(3Z)-5-ethyl-3-[2-keto-2-(2-thienyl)ethylidene]oxindole::5-ethyl-3-[2-oxo-2-(2-thienyl)ethylidene]-1,3-dihydro-2H-indol-2-one::MLS000536892::SMR000143539::cid_977927
SMILES CCc1ccc2NC(=O)\C(=C/C(=O)c3cccs3)c2c1
InChI Key InChIKey=ITYGMUOLJUBSJY-XFXZXTDPSA-N
Data  2 IC50  5 EC50
  Tab Delimited (TSV)   2D SDfile   Computed 3D by Vconf -m prep SDfile
Find this compound or compounds like it in BindingDB:
Activity Spreadsheet -- Enzyme Inhibition Constant Data from BindingDB
Found 7 hits for monomerid = 64576
Target60S ribosomal protein L19-A(Saccharomyces cerevisiae)
Nmmlsc
Curated by PubChem BioAssay
LigandPNGBDBM64576((3Z)-5-ethyl-3-(2-oxidanylidene-2-thiophen-2-yl-et...)
Affinity DataEC50:  4.42E+3nM. Assay description: University of New Mexico Assay Overview: Assay Support: 1R03 MH086450-01 Project Title: Chemical Screen of TOR pathway GFP fusion proteins in S. ...
In DepthDetails PCBioAssay
TargetVacuolar aminopeptidase 1(Saccharomyces cerevisiae)
Nmmlsc
Curated by PubChem BioAssay
LigandPNGBDBM64576((3Z)-5-ethyl-3-(2-oxidanylidene-2-thiophen-2-yl-et...)
Affinity DataEC50:  4.07E+3nM. Assay description: University of New Mexico Assay Overview: Assay Support: 1R03 MH086450-01 Project Title: Chemical Screen of TOR pathway GFP fusion proteins in S. ...
In DepthDetails PCBioAssay
TargetATP-dependent molecular chaperone HSP82(Candida albicans)
Broad Institute
Curated by PubChem BioAssay
LigandPNGBDBM64576((3Z)-5-ethyl-3-(2-oxidanylidene-2-thiophen-2-yl-et...)
Affinity DataEC50:  2.91E+3nM. Assay description: Keywords: Candida albicans, drug resistance, Fluconazole, Hsp90, stress response Assay Overview: Method for determining if compound acts as Hsp90 inh...
In DepthDetails PCBioAssay
TargetReceptor-interacting serine/threonine-protein kinase 2(Homo sapiens (Human))
The Scripps Research Institute Molecular Screening Center
Curated by PubChem BioAssay
LigandPNGBDBM64576((3Z)-5-ethyl-3-(2-oxidanylidene-2-thiophen-2-yl-et...)
Affinity DataIC50:  4.53E+3nM
In DepthDetails PCBioAssay
TargetNeurotensin receptor type 1(Homo sapiens (Human))
Burnham Center For Chemical Genomics
Curated by PubChem BioAssay
LigandPNGBDBM64576((3Z)-5-ethyl-3-(2-oxidanylidene-2-thiophen-2-yl-et...)
Affinity DataEC50:  1.77E+4nM. Assay description: Data Source: Sanford-Burnham Center for Chemical Genomics (SBCCG) Source Affiliation: Sanford-Burnham Medical Research Institute (SBMRI, San Diego, C...
In DepthDetails PCBioAssay
TargetBeta-lactamase(Pseudomonas aeruginosa)
The Scripps Research Institute Molecular Screening Center
Curated by PubChem BioAssay
LigandPNGBDBM64576((3Z)-5-ethyl-3-(2-oxidanylidene-2-thiophen-2-yl-et...)
Affinity DataIC50: >4.97E+4nM
In DepthDetails PCBioAssay
TargetSerine/threonine-protein phosphatase(Candida dubliniensis CD36)
Broad Institute
Curated by PubChem BioAssay
LigandPNGBDBM64576((3Z)-5-ethyl-3-(2-oxidanylidene-2-thiophen-2-yl-et...)
Affinity DataEC50:  5.99E+3nM. Assay description: Keywords: Candida albicans, drug resistance, Fluconazole, calcineurin, stress response Assay Overview: Method for determining if compound acts as Ca...
In DepthDetails PCBioAssay