BDBM66118 (6E)-5-azanylidene-6-[(4-oxidanylidenechromen-3-yl)methylidene]-[1,3]thiazolo[3,2-a]pyrimidin-7-one::(6E)-5-imino-6-[(4-ketochromen-3-yl)methylene]thiazolo[3,2-a]pyrimidin-7-one::(6E)-5-imino-6-[(4-oxo-1-benzopyran-3-yl)methylidene]-7-thiazolo[3,2-a]pyrimidinone::(6E)-5-imino-6-[(4-oxochromen-3-yl)methylidene]-[1,3]thiazolo[3,2-a]pyrimidin-7-one::5-Imino-6-[1-(4-oxo-4H-chromen-3-yl)-meth-(E)-ylidene]-5,6-dihydro-thiazolo[3,2-a]pyrimidin-7-one::MLS000332035::SMR000221459::cid_2037851
SMILES N=C1N2C=CSC2=NC(=O)\C1=C\c1coc2ccccc2c1=O
InChI Key InChIKey=SRERZXVDVJILHR-GNPCJPGPSA-N
Data  3 IC50
  Tab Delimited (TSV)   2D SDfile   Computed 3D by Vconf -m prep SDfile
Find this compound or compounds like it in BindingDB:
Activity Spreadsheet -- Enzyme Inhibition Constant Data from BindingDB
Found 3 hits for monomerid = 66118
TargetBeta-lactamase(Pseudomonas aeruginosa)
The Scripps Research Institute Molecular Screening Center
Curated by PubChem BioAssay
LigandPNGBDBM66118((6E)-5-azanylidene-6-[(4-oxidanylidenechromen-3-yl...)
Affinity DataIC50:  2.55E+4nM. Assay description: Source (MLPCN Center Name): The Scripps Research Institute Molecular Screening Center (SRIMSC) Center Affiliation: The Scripps Research Institute (TS...
In DepthDetails PCBioAssay
TargetBeta-lactamase(Pseudomonas aeruginosa)
The Scripps Research Institute Molecular Screening Center
Curated by PubChem BioAssay
LigandPNGBDBM66118((6E)-5-azanylidene-6-[(4-oxidanylidenechromen-3-yl...)
Affinity DataIC50:  3.64E+4nM. Assay description: Source (MLPCN Center Name): The Scripps Research Institute Molecular Screening Center (SRIMSC) Center Affiliation: The Scripps Research Institute (TS...
In DepthDetails PCBioAssay
TargetBeta-lactamase(Salmonella enterica subsp. enterica serovar Choler...)
The Scripps Research Institute Molecular Screening Center
Curated by PubChem BioAssay
LigandPNGBDBM66118((6E)-5-azanylidene-6-[(4-oxidanylidenechromen-3-yl...)
Affinity DataIC50: >5.96E+4nM. Assay description: Source (MLPCN Center Name): The Scripps Research Institute Molecular Screening Center (SRIMSC) Center Affiliation: The Scripps Research Institute (TS...
In DepthDetails PCBioAssay