BDBM75756 (E)-1-(2-furanyl)-3-(2-hydroxyphenyl)-2-propen-1-one::(E)-1-(2-furyl)-3-(2-hydroxyphenyl)prop-2-en-1-one::(E)-1-(furan-2-yl)-3-(2-hydroxyphenyl)prop-2-en-1-one::1-Furan-2-yl-3-(2-hydroxy-phenyl)-propenone::MLS001203728::SMR000515331::cid_5760303
SMILES Oc1ccccc1\C=C\C(=O)c1ccco1
InChI Key InChIKey=CTPZVSOXBBLRFZ-BQYQJAHWSA-N
Data  5 IC50
  Tab Delimited (TSV)   2D SDfile   Computed 3D by Vconf -m prep SDfile
Find this compound or compounds like it in BindingDB:
Activity Spreadsheet -- Enzyme Inhibition Constant Data from BindingDB
Found 5 hits for monomerid = 75756
TargetIntestinal-type alkaline phosphatase(Homo sapiens (Human))
Burnham Center For Chemical Genomics
Curated by PubChem BioAssay
LigandPNGBDBM75756((E)-1-(2-furanyl)-3-(2-hydroxyphenyl)-2-propen-1-o...)
Affinity DataIC50:  4.76E+4nM. Assay description: Data Source: Sanford-Burnham Center for Chemical Genomics (SBCCG) Source Affiliation: Sanford-Burnham Medical Research Institute (SBMRI, San Diego, C...
In DepthDetails PCBioAssay
TargetIntestinal-type alkaline phosphatase 1(Rattus norvegicus (Rat))
Burnham Center For Chemical Genomics
Curated by PubChem BioAssay
LigandPNGBDBM75756((E)-1-(2-furanyl)-3-(2-hydroxyphenyl)-2-propen-1-o...)
Affinity DataIC50:  6.29E+4nM. Assay description: Data Source: Sanford-Burnham Center for Chemical Genomics (SBCCG) Source Affiliation: Sanford-Burnham Medical Research Institute (SBMRI, San Diego, C...
In DepthDetails PCBioAssay
TargetIntestinal-type alkaline phosphatase(Homo sapiens (Human))
Burnham Center For Chemical Genomics
Curated by PubChem BioAssay
LigandPNGBDBM75756((E)-1-(2-furanyl)-3-(2-hydroxyphenyl)-2-propen-1-o...)
Affinity DataIC50:  7.58E+4nM. Assay description: Data Source: Sanford-Burnham Center for Chemical Genomics (SBCCG) Source Affiliation: Sanford-Burnham Medical Research Institute(SBMRI, San Diego, CA...
In DepthDetails PCBioAssay
TargetAlkaline phosphatase, germ cell type(Homo sapiens (Human))
Burnham Center For Chemical Genomics
Curated by PubChem BioAssay
LigandPNGBDBM75756((E)-1-(2-furanyl)-3-(2-hydroxyphenyl)-2-propen-1-o...)
Affinity DataIC50:  7.54E+4nM. Assay description: Data Source: Sanford-Burnham Center for Chemical Genomics (SBCCG) Source Affiliation: Sanford-Burnham Medical Research Institute(SBMRI, San Diego, CA...
In DepthDetails PCBioAssay
TargetAlkaline phosphatase, tissue-nonspecific isozyme(Homo sapiens (Human))
Burnham Center For Chemical Genomics
Curated by PubChem BioAssay
LigandPNGBDBM75756((E)-1-(2-furanyl)-3-(2-hydroxyphenyl)-2-propen-1-o...)
Affinity DataIC50:  7.18E+4nM. Assay description: Data Source: Sanford-Burnham Center for Chemical Genomics (SBCCG) Source Affiliation: Sanford-Burnham Medical Research Institute(SBMRI, San Diego, CA...
In DepthDetails PCBioAssay