BDBM75931 SR-02000000467::SR-02000000467-1::[1-(2-methylbenzyl)-2-piperidyl]-[4-(4-nitrophenyl)piperazino]methanone::[1-[(2-methylphenyl)methyl]-2-piperidinyl]-[4-(4-nitrophenyl)-1-piperazinyl]methanone::[1-[(2-methylphenyl)methyl]piperidin-2-yl]-[4-(4-nitrophenyl)piperazin-1-yl]methanone::cid_46846324
SMILES Cc1ccccc1CN1CCCCC1C(=O)N1CCN(CC1)c1ccc(cc1)[N+]([O-])=O
InChI Key InChIKey=MYXDVMGDQLOFDW-UHFFFAOYSA-N
Data  2 IC50
  Tab Delimited (TSV)   2D SDfile   Computed 3D by Vconf -m prep SDfile
Find this compound or compounds like it in BindingDB:
Activity Spreadsheet -- Enzyme Inhibition Constant Data from BindingDB
Found 2 hits for monomerid = 75931
TargetNeuropeptides B/W receptor type 1(Homo sapiens (Human))
The Scripps Research Institute Molecular Screening Center
Curated by PubChem BioAssay
LigandPNGBDBM75931(SR-02000000467 | SR-02000000467-1 | [1-(2-methylbe...)
Affinity DataIC50:  1.10E+4nM. Assay description: Source (MLPCN Center Name): The Scripps Research Institute Molecular Screening Center (SRIMSC) Affiliation: The Scripps Research Institute, TSRI Assa...
In DepthDetails PCBioAssay
TargetMelanin-concentrating hormone receptor 1(Homo sapiens (Human))
The Scripps Research Institute Molecular Screening Center
Curated by PubChem BioAssay
LigandPNGBDBM75931(SR-02000000467 | SR-02000000467-1 | [1-(2-methylbe...)
Affinity DataIC50:  5.80E+3nM. Assay description: Source (MLPCN Center Name): The Scripps Research Institute Molecular Screening Center (SRIMSC) Affiliation: The Scripps Research Institute, TSRI Assa...
In DepthDetails PCBioAssay