BDBM75994 1-(2-thienyl)-2-[[6-(2-thienyl)pyridazin-3-yl]thio]ethanone::1-thiophen-2-yl-2-(6-thiophen-2-ylpyridazin-3-yl)sulfanyl-ethanone::1-thiophen-2-yl-2-(6-thiophen-2-ylpyridazin-3-yl)sulfanylethanone::1-thiophen-2-yl-2-[(6-thiophen-2-yl-3-pyridazinyl)thio]ethanone::MLS000678474::SMR000323960::cid_7207253
SMILES O=C(CSc1ccc(nn1)-c1cccs1)c1cccs1
InChI Key InChIKey=BUEYTYZOCKWHHR-UHFFFAOYSA-N
Data  4 IC50
  Tab Delimited (TSV)   2D SDfile   Computed 3D by Vconf -m prep SDfile
Find this compound or compounds like it in BindingDB:
Activity Spreadsheet -- Enzyme Inhibition Constant Data from BindingDB
Found 4 hits for monomerid = 75994
TargetIsoform 2 of Nuclear receptor corepressor 2 (TRAC-1)(Homo sapiens (Human))
The Scripps Research Institute Molecular Screening Center
Curated by PubChem BioAssay
LigandPNGBDBM75994(1-(2-thienyl)-2-[[6-(2-thienyl)pyridazin-3-yl]thio...)
Affinity DataIC50:  9.50E+3nM. Assay description: Source (MLPCN Center Name): The Scripps Research Institute Molecular Screening Center Affiliation: The Scripps Research Institute, TSRI Assay Provide...
In DepthDetails PCBioAssay
TargetOrexin/Hypocretin receptor type 1(Homo sapiens (Human))
The Scripps Research Institute Molecular Screening Center
Curated by PubChem BioAssay
LigandPNGBDBM75994(1-(2-thienyl)-2-[[6-(2-thienyl)pyridazin-3-yl]thio...)
Affinity DataIC50: >614nM. Assay description: Source (MLPCN Center Name): The Scripps Research Institute Molecular Screening Center (SRIMSC) Affiliation: The Scripps Research Institute, TSRI Assa...
In DepthDetails PCBioAssay
TargetOrexin/Hypocretin receptor type 1(Homo sapiens (Human))
The Scripps Research Institute Molecular Screening Center
Curated by PubChem BioAssay
LigandPNGBDBM75994(1-(2-thienyl)-2-[[6-(2-thienyl)pyridazin-3-yl]thio...)
Affinity DataIC50:  2.28E+3nM. Assay description: Source (MLPCN Center Name): The Scripps Research Institute Molecular Screening Center (SRIMSC) Affiliation: The Scripps Research Institute, TSRI Assa...
In DepthDetails PCBioAssay
TargetPhotoreceptor-specific nuclear receptor(Homo sapiens (Human))
The Scripps Research Institute Molecular Screening Center
Curated by PubChem BioAssay
LigandPNGBDBM75994(1-(2-thienyl)-2-[[6-(2-thienyl)pyridazin-3-yl]thio...)
Affinity DataIC50:  8.97E+3nM. Assay description: Source (MLPCN Center Name): The Scripps Research Institute Molecular Screening Center Affiliation: The Scripps Research Institute, TSRI Assay Provide...
In DepthDetails PCBioAssay