BDBM76062 2-(4-chlorophenyl)-7-methyl-4-phenyl-pyrazolo[3,4-d]pyridazine::2-(4-chlorophenyl)-7-methyl-4-phenylpyrazolo[3,4-d]pyridazine::MLS-0437168.0001::cid_4623233
SMILES Cc1nnc(-c2ccccc2)c2cn(nc12)-c1ccc(Cl)cc1
InChI Key InChIKey=PWUHTKASVHDMBY-UHFFFAOYSA-N
Data  4 IC50  3 EC50
  Tab Delimited (TSV)   2D SDfile   Computed 3D by Vconf -m prep SDfile
Find this compound or compounds like it in BindingDB:
Activity Spreadsheet -- Enzyme Inhibition Constant Data from BindingDB
Found 7 hits for monomerid = 76062
TargetCannabinoid receptor 2(Homo sapiens (Human))
Burnham Center For Chemical Genomics
Curated by PubChem BioAssay
LigandPNGBDBM76062(2-(4-chlorophenyl)-7-methyl-4-phenyl-pyrazolo[3,4-...)
Affinity DataEC50: >3.20E+4nM. Assay description: Data Source: Sanford-Burnham Center for Chemical Genomics Source Affiliation: Sanford-Burnham Medical Research Institute (SBMRI, San Diego, CA) Netw...
In DepthDetails PCBioAssay
TargetCannabinoid receptor 2(Homo sapiens (Human))
Burnham Center For Chemical Genomics
Curated by PubChem BioAssay
LigandPNGBDBM76062(2-(4-chlorophenyl)-7-methyl-4-phenyl-pyrazolo[3,4-...)
Affinity DataIC50: >3.20E+4nM. Assay description: Data Source: Sanford-Burnham Center for Chemical Genomics Source Affiliation: Sanford-Burnham Medical Research Institute (SBMRI, San Diego, CA) Netw...
In DepthDetails PCBioAssay
TargetCannabinoid receptor 1(Homo sapiens (Human))
Burnham Center For Chemical Genomics
Curated by PubChem BioAssay
LigandPNGBDBM76062(2-(4-chlorophenyl)-7-methyl-4-phenyl-pyrazolo[3,4-...)
Affinity DataEC50: >3.20E+4nM. Assay description: Data Source: Sanford-Burnham Center for Chemical Genomics Source Affiliation: Sanford-Burnham Medical Research Institute (SBMRI, San Diego) Network...
In DepthDetails PCBioAssay
TargetG-protein coupled receptor 55(Homo sapiens (Human))
Burnham Center For Chemical Genomics
Curated by PubChem BioAssay
LigandPNGBDBM76062(2-(4-chlorophenyl)-7-methyl-4-phenyl-pyrazolo[3,4-...)
Affinity DataIC50:  1.77E+3nM. Assay description: Data Source: Sanford-Burnham Center for Chemical Genomics(SBCCG) Source Affiliation: Sanford-Burnham Medical Research Institute (SBMRI, San Diego, C...
In DepthDetails PCBioAssay
TargetCannabinoid receptor 1(Homo sapiens (Human))
Burnham Center For Chemical Genomics
Curated by PubChem BioAssay
LigandPNGBDBM76062(2-(4-chlorophenyl)-7-methyl-4-phenyl-pyrazolo[3,4-...)
Affinity DataIC50:  3.63E+3nM. Assay description: Data Source: Sanford-Burnham Center for Chemical Genomics Source Affiliation: Sanford-Burnham Medical Research Institute (SBMRI, San Diego) Network...
In DepthDetails PCBioAssay
TargetG-protein coupled receptor 35(Homo sapiens (Human))
Burnham Center For Chemical Genomics
Curated by PubChem BioAssay
LigandPNGBDBM76062(2-(4-chlorophenyl)-7-methyl-4-phenyl-pyrazolo[3,4-...)
Affinity DataEC50: >3.20E+4nM. Assay description: Data Source: Sanford-Burnham Center for Chemical Genomics Source Affiliation: Sanford-Burnham Medical Research Institute Network: NIH Molecular Libr...
In DepthDetails PCBioAssay
TargetG-protein coupled receptor 35(Homo sapiens (Human))
Burnham Center For Chemical Genomics
Curated by PubChem BioAssay
LigandPNGBDBM76062(2-(4-chlorophenyl)-7-methyl-4-phenyl-pyrazolo[3,4-...)
Affinity DataIC50:  2.30E+4nM. Assay description: Data Source: Sanford-Burnham Center for Chemical Genomics (SBCCG) Source Affiliation: Sanford-Burnham Medical Research Institute (SBMRI, San Diego, C...
In DepthDetails PCBioAssay