BDBM77078 MLS000106017::N-[4-chloranyl-3-(trifluoromethyl)phenyl]furan-2-carboxamide::N-[4-chloro-3-(trifluoromethyl)phenyl]-2-furamide::N-[4-chloro-3-(trifluoromethyl)phenyl]-2-furancarboxamide::N-[4-chloro-3-(trifluoromethyl)phenyl]furan-2-carboxamide::SMR000102990::cid_684592
SMILES FC(F)(F)c1cc(NC(=O)c2ccco2)ccc1Cl
InChI Key InChIKey=IXPWQMXVCBNFBA-UHFFFAOYSA-N
Data  2 IC50  1 EC50
  Tab Delimited (TSV)   2D SDfile   Computed 3D by Vconf -m prep SDfile
Find this compound or compounds like it in BindingDB:
Activity Spreadsheet -- Enzyme Inhibition Constant Data from BindingDB
Found 3 hits for monomerid = 77078
TargetVoltage-dependent T-type calcium channel subunit alpha-1H(Homo sapiens (Human))
Vanderbilt Screening Center For Gpcrs, Ion Channels and Transporters
Curated by PubChem BioAssay
LigandPNGBDBM77078(MLS000106017 | N-[4-chloranyl-3-(trifluoromethyl)p...)
Affinity DataEC50:  1.06E+4nM. Assay description: Assay Provider: Xinmin Xie Assay Provider Affiliation: Bioscience Division, SRI International, Menlo Park, CA Grant Title: HTS Assay for Cav3 T-Type ...
In DepthDetails PCBioAssay
TargetProtein skinhead-1(Caenorhabditis elegans)
Burnham Center For Chemical Genomics
Curated by PubChem BioAssay
LigandPNGBDBM77078(MLS000106017 | N-[4-chloranyl-3-(trifluoromethyl)p...)
Affinity DataIC50:  6.44E+4nM
In DepthDetails PCBioAssay
TargetMitochondrial import inner membrane translocase subunit TIM10(Saccharomyces cerevisiae S288c)
Burnham Center For Chemical Genomics
Curated by PubChem BioAssay
LigandPNGBDBM77078(MLS000106017 | N-[4-chloranyl-3-(trifluoromethyl)p...)
Affinity DataIC50:  2.87E+4nM. Assay description: Data Source: Sanford-Burnham Center for Chemical Genomics (SBCCG) Source Affiliation: Sanford-Burnham Medical Research Institute(SBMRI, San Diego, CA...
In DepthDetails PCBioAssay