BDBM84266 2-{[4-(1,3-benzodioxol-5-ylmethyl)-1-piperazinyl]carbonyl}-4H-pyrido[1,2-a]thieno[2,3-d]pyrimidin-4-one::MLS000664636::SMR000296344::cid_1253647
SMILES O=C(N1CCN(Cc2ccc3OCOc3c2)CC1)c1cc2c(nc3ccccn3c2=O)s1
InChI Key InChIKey=ILROLKAWTJALIA-UHFFFAOYSA-N
Data  1 IC50  2 EC50
  Tab Delimited (TSV)   2D SDfile   Computed 3D by Vconf -m prep SDfile
Find this compound or compounds like it in BindingDB:
Activity Spreadsheet -- Enzyme Inhibition Constant Data from BindingDB
Found 3 hits for monomerid = 84266
TargetBeta-2 adrenergic receptor(Homo sapiens (Human))
Nmmlsc
Curated by PubChem BioAssay
LigandPNGBDBM84266(2-{[4-(1,3-benzodioxol-5-ylmethyl)-1-piperazinyl]c...)
Affinity DataEC50:  69.3nM. Assay description: University of New Mexico Assay Overview: Assay Support: R03 MH093192-01 Project Title: HTS for Non-Canonical Ligands for Beta 2 Adrenergic Receptor...
In DepthDetails PCBioAssay
TargetFructose-bisphosphate aldolase(Mycobacterium tuberculosis (strain H37Rv))
The Scripps Research Institute Molecular Screening Center
Curated by PubChem BioAssay
LigandPNGBDBM84266(2-{[4-(1,3-benzodioxol-5-ylmethyl)-1-piperazinyl]c...)
Affinity DataIC50: >1.11E+3nM
In DepthDetails PCBioAssay
TargetBeta-2 adrenergic receptor(Homo sapiens (Human))
Nmmlsc
Curated by PubChem BioAssay
LigandPNGBDBM84266(2-{[4-(1,3-benzodioxol-5-ylmethyl)-1-piperazinyl]c...)
Affinity DataEC50:  9.77nM. Assay description: University of New Mexico Assay Overview: Assay Support: R03 MH093192-01 Project Title: HTS for Non-Canonical Ligands for Beta 2 Adrenergic Receptor...
In DepthDetails PCBioAssay