BDBM87050 Bisanilinopyrimidine inhibitor, 4::Bisanilinopyrimidine, 6h::US9249124, 31
SMILES OC(=O)c1ccc(Nc2nccc(Nc3ccccc3C(F)(F)F)n2)cc1
InChI Key InChIKey=QFNWNXOHCUAEBM-UHFFFAOYSA-N
Data  5 IC50  2 Kd  1 ITC
PDB links: 1 PDB ID matches this monomer.
  Tab Delimited (TSV)   2D SDfile   Computed 3D by Vconf -m prep SDfile
Find this compound or compounds like it in BindingDB:
Activity Spreadsheet -- Enzyme Inhibition Constant Data from BindingDB
Found 5 hits for monomerid = 87050
TargetAurora kinase A(Homo sapiens (Human))
Moffitt Cancer Center
LigandPNGBDBM87050(Bisanilinopyrimidine inhibitor, 4 | Bisanilinopyri...)
Affinity DataIC50:  35nM Kd:  49nMpH: 7.4 T: 2°C. Assay description: The formation of ADP from ATP was quantified using a coupled enzyme assay (DiscoverX) in with a fluorescent resorufin dye is generated from the inter...
TargetAurora kinase A(Homo sapiens (Human))
Moffitt Cancer Center
LigandPNGBDBM87050(Bisanilinopyrimidine inhibitor, 4 | Bisanilinopyri...)
Affinity DataIC50:  35.1nM. Assay description: In vitro enzyme activity assay using Aurora Kinase A.
TargetAurora kinase A(Homo sapiens (Human))
Moffitt Cancer Center
LigandPNGBDBM87050(Bisanilinopyrimidine inhibitor, 4 | Bisanilinopyri...)
Affinity DataIC50:  35nM Kd:  49nMpH: 7.4Assay Description:The binding of inhibitors to Aurora A kinase was analyzed with a MicroCal iTC200 titration calorimeter (GE Healthcare, Piscataway, N.J.). The protein...
TargetAurora kinase A(Homo sapiens (Human))
Moffitt Cancer Center
LigandPNGBDBM87050(Bisanilinopyrimidine inhibitor, 4 | Bisanilinopyri...)
Affinity DataIC50:  35nMpH: 7.4 T: 2°C. Assay description: Aurora A was exchanged into 50 mM phosphate buffer (pH 7.4) including 1 mM DTT via PD-10 columns and was concentrated to 20 mg mL-1 using Amicon Ultr...
TargetAurora kinase A(Homo sapiens (Human))
Moffitt Cancer Center
LigandPNGBDBM87050(Bisanilinopyrimidine inhibitor, 4 | Bisanilinopyri...)
Affinity DataIC50:  35nMpH: 7.4 T: 2°C. Assay description: Reactions were carried out at room temperature in 15 mM HEPES buffer (pH 7.4) containing 20 mM NaCl, 1 mM EGTA, 0.02% Tween 20, 10 mM MgCl2, 5% (v/v)...
Activity Spreadsheet -- ITC Data from BindingDB
Found 1 hit for monomerid = 87050
CellSerine/threonine-protein kinase Aurora-A(Homo sapiens (Human))
Moffitt Cancer Center
SyringePNGBDBM87050(Bisanilinopyrimidine inhibitor, 4 | Bisanilinopyri...)
ITC Data−TΔS°: -4.27kcal/mole ΔH°: -14.1kcal/mole
pH: 7.4 T: 25.00°C