BDBM87726 MLS000539029::N-(4-keto-6,7-dimethoxy-2-thioxo-1H-quinazolin-3-yl)benzamide::N-(6,7-dimethoxy-4-oxidanylidene-2-sulfanylidene-1H-quinazolin-3-yl)benzamide::N-(6,7-dimethoxy-4-oxo-2-sulfanylidene-1H-quinazolin-3-yl)benzamide::N-(6,7-dimethoxy-4-oxo-2-thioxo-1,4-dihydro-3(2H)-quinazolinyl)benzamide::SMR000144844::cid_1861856
SMILES COc1cc2[nH]c(=S)n(NC(=O)c3ccccc3)c(=O)c2cc1OC
InChI Key InChIKey=XVQWJFMULPQCIV-UHFFFAOYSA-N
Data  3 IC50
  Tab Delimited (TSV)   2D SDfile   Computed 3D by Vconf -m prep SDfile
Find this compound or compounds like it in BindingDB:
Activity Spreadsheet -- Enzyme Inhibition Constant Data from BindingDB
Found 3 hits for monomerid = 87726
TargetEnvelope glycoprotein gp160(Human immunodeficiency virus type 1 group M subtyp...)
The Scripps Research Institute Molecular Screening Center
Curated by PubChem BioAssay
LigandPNGBDBM87726(MLS000539029 | N-(4-keto-6,7-dimethoxy-2-thioxo-1H...)
Affinity DataIC50: >6.70E+4nM
In DepthDetails PCBioAssay
TargetEnvelope glycoprotein gp160(Human immunodeficiency virus type 1 group M subtyp...)
The Scripps Research Institute Molecular Screening Center
Curated by PubChem BioAssay
LigandPNGBDBM87726(MLS000539029 | N-(4-keto-6,7-dimethoxy-2-thioxo-1H...)
Affinity DataIC50:  2.51E+4nM
In DepthDetails PCBioAssay
TargetEnvelope glycoprotein gp160(Human immunodeficiency virus type 1 group M subtyp...)
The Scripps Research Institute Molecular Screening Center
Curated by PubChem BioAssay
LigandPNGBDBM87726(MLS000539029 | N-(4-keto-6,7-dimethoxy-2-thioxo-1H...)
Affinity DataIC50:  4.34E+4nM
In DepthDetails PCBioAssay