BDBM88584 (2-oxidanylidenecyclohexyl) 2-[(4-phenoxyphenyl)carbonylamino]ethanoate::(2-oxocyclohexyl) 2-[(4-phenoxybenzoyl)amino]acetate::2-[(4-phenoxybenzoyl)amino]acetic acid (2-ketocyclohexyl) ester::2-[[oxo-(4-phenoxyphenyl)methyl]amino]acetic acid (2-oxocyclohexyl) ester::MLS000571049::SMR000150713::cid_4235517
SMILES O=C(CNC(=O)c1ccc(Oc2ccccc2)cc1)OC1CCCCC1=O
InChI Key InChIKey=ITHIIPPDVQTGRB-UHFFFAOYSA-N
Data  1 IC50
  Tab Delimited (TSV)   2D SDfile   Computed 3D by Vconf -m prep SDfile
Find this compound or compounds like it in BindingDB:
Activity Spreadsheet -- Enzyme Inhibition Constant Data from BindingDB
Found 1 hit for monomerid = 88584
TargetMelanocortin receptor 4(Homo sapiens (Human))
The Scripps Research Institute Molecular Screening Center
Curated by PubChem BioAssay
LigandPNGBDBM88584((2-oxidanylidenecyclohexyl) 2-[(4-phenoxyphenyl)ca...)
Affinity DataIC50: >6.46E+4nM. Assay description: Source (MLPCN Center Name): The Scripps Research Institute Molecular Screening Center (SRISMC) Center Affiliation: The Scripps Research Institute, TS...
In DepthDetails PCBioAssay