BDBM89095 7-bromanyl-2-[[5-(trifluoromethyl)pyridin-2-yl]sulfanylmethyl]pyrido[1,2-a]pyrimidin-4-one::7-bromo-2-[[5-(trifluoromethyl)pyridin-2-yl]sulfanylmethyl]pyrido[1,2-a]pyrimidin-4-one::7-bromo-2-[[[5-(trifluoromethyl)-2-pyridinyl]thio]methyl]-4-pyrido[1,2-a]pyrimidinone::7-bromo-2-[[[5-(trifluoromethyl)-2-pyridyl]thio]methyl]pyrido[1,2-a]pyrimidin-4-one::MLS-0463363.0001::cid_16232724
SMILES FC(F)(F)c1ccc(SCc2cc(=O)n3cc(Br)ccc3n2)nc1
InChI Key InChIKey=QWAGMSFWYPQGAU-UHFFFAOYSA-N
Data  3 IC50
  Tab Delimited (TSV)   2D SDfile   Computed 3D by Vconf -m prep SDfile
Find this compound or compounds like it in BindingDB:
Activity Spreadsheet -- Enzyme Inhibition Constant Data from BindingDB
Found 3 hits for monomerid = 89095
TargetMitochondrial import inner membrane translocase subunit TIM23(Saccharomyces cerevisiae S288c)
Burnham Center For Chemical Genomics
Curated by PubChem BioAssay
LigandPNGBDBM89095(7-bromanyl-2-[[5-(trifluoromethyl)pyridin-2-yl]sul...)
Affinity DataIC50: >9.90E+4nM. Assay description: Data Source: Sanford-Burnham Center for Chemical Genomics (SBCCG) Source Affiliation: Sanford-Burnham Medical Research Institute(SBMRI, San Diego, CA...
In DepthDetails PCBioAssay
TargetMitochondrial import inner membrane translocase subunit TIM10(Saccharomyces cerevisiae S288c)
Burnham Center For Chemical Genomics
Curated by PubChem BioAssay
LigandPNGBDBM89095(7-bromanyl-2-[[5-(trifluoromethyl)pyridin-2-yl]sul...)
Affinity DataIC50:  5.56E+4nM. Assay description: Data Source: Sanford-Burnham Center for Chemical Genomics (SBCCG) Source Affiliation: Sanford-Burnham Medical Research Institute(SBMRI, San Diego, CA...
In DepthDetails PCBioAssay
TargetMitochondrial import inner membrane translocase subunit TIM10(Saccharomyces cerevisiae S288c)
Burnham Center For Chemical Genomics
Curated by PubChem BioAssay
LigandPNGBDBM89095(7-bromanyl-2-[[5-(trifluoromethyl)pyridin-2-yl]sul...)
Affinity DataIC50:  8.53E+4nM. Assay description: Data Source: Sanford-Burnham Center for Chemical Genomics (SBCCG) Source Affiliation: Sanford-Burnham Medical Research Institute(SBMRI, San Diego, CA...
In DepthDetails PCBioAssay