BDBM89640 3-(2,5,6-trimethyl-1-benzimidazolyl)-1-propanamine;hydrochloride::3-(2,5,6-trimethyl-1H-benzimidazol-1-yl)propan-1-amine::3-(2,5,6-trimethylbenzimidazol-1-yl)propan-1-amine;hydrochloride::3-(2,5,6-trimethylbenzimidazol-1-yl)propylamine;hydrochloride::MLS000048028::SMR000048853::cid_6603308
SMILES Cc1nc2cc(C)c(C)cc2n1CCCN
InChI Key InChIKey=PXYRYUMOPIPCSY-UHFFFAOYSA-N
Data  1 EC50
  Tab Delimited (TSV)   2D SDfile   Computed 3D by Vconf -m prep SDfile
Find this compound or compounds like it in BindingDB:
Activity Spreadsheet -- Enzyme Inhibition Constant Data from BindingDB
Found 1 hit for monomerid = 89640
TargetCorticotropin-releasing factor-binding protein(Homo sapiens (Human))
Burnham Center For Chemical Genomics
Curated by PubChem BioAssay
LigandPNGBDBM89640(3-(2,5,6-trimethyl-1-benzimidazolyl)-1-propanamine...)
Affinity DataEC50: >5.30E+4nM. Assay description: Data Source: Sanford-Burnham Center for Chemical Genomics (SBCCG) Source Affiliation: Sanford-Burnham Medical Research Institute (SBMRI, San Diego, C...
Ligand InfoPC cidPC sid
In DepthDetails PCBioAssay