BDBM91824 Chk1_1
SMILES COc1cc(OC)c(NC(=O)Nc2cnccn2)cc1Cl
InChI Key InChIKey=YHZULYLGPVGRKP-UHFFFAOYSA-N
Data  1 KI
PDB links: 1 PDB ID matches this monomer.
  Tab Delimited (TSV)   2D SDfile   Computed 3D by Vconf -m prep SDfile
Find this compound or compounds like it in BindingDB:
Activity Spreadsheet -- Enzyme Inhibition Constant Data from BindingDB
Found 1 hit for monomerid = 91824
TargetSerine/threonine-protein kinase Chk1(Homo sapiens (Human))
Abbott Laboratories
Curated by ChEMBL
LigandPNGBDBM91824(Chk1_1)
Affinity DataKi:  631nM. Assay description: Inhibition of Chk1