BDBM92560 Neoflavonoid, 19
SMILES COc1cc(cc(OC)c1OC)C1CC(=O)Nc2cc3OCOc3cc12
InChI Key InChIKey=HABWWDBJGQYHMD-UHFFFAOYSA-N
Data  1 KI
  Tab Delimited (TSV)   2D SDfile   Computed 3D by Vconf -m prep SDfile
Find this compound or compounds like it in BindingDB:
Activity Spreadsheet -- Enzyme Inhibition Constant Data from BindingDB
Found 1 hit for monomerid = 92560
TargetAromatase(Homo sapiens (Human))
Central Institute of Medicinal and Aromatic Plants
LigandPNGBDBM92560(Neoflavonoid, 19)
Affinity DataKi:  0.00597nM. Assay description: Inhibition assay using aromatase enzyme.
In DepthDetails ArticlePubMed