BDBM93750 4-{5-[3-(2,4-Dichloro-phenoxy)-propyl]-[1,2,4]oxadiazol-3-yl}-pyridine::5-[3-(2,4-dichlorophenoxy)propyl]-3-(4-pyridyl)-1,2,4-oxadiazole::5-[3-(2,4-dichlorophenoxy)propyl]-3-pyridin-4-yl-1,2,4-oxadiazole::5-[3-[2,4-bis(chloranyl)phenoxy]propyl]-3-pyridin-4-yl-1,2,4-oxadiazole::MLS000528821::SMR000121296::cid_1971455
SMILES Clc1ccc(OCCCc2nc(no2)-c2ccncc2)c(Cl)c1
InChI Key InChIKey=UHQJKSBUXZHCDW-UHFFFAOYSA-N
Data  2 IC50
  Tab Delimited (TSV)   2D SDfile   Computed 3D by Vconf -m prep SDfile
Find this compound or compounds like it in BindingDB:
Activity Spreadsheet -- Enzyme Inhibition Constant Data from BindingDB
Found 2 hits for monomerid = 93750
TargetHeat shock protein hsp-16.2(Caenorhabditis elegans)
Burnham Center For Chemical Genomics
Curated by PubChem BioAssay
LigandPNGBDBM93750(4-{5-[3-(2,4-Dichloro-phenoxy)-propyl]-[1,2,4]oxad...)
Affinity DataIC50: >6.40E+4nM
In DepthDetails PCBioAssay
TargetProtein skinhead-1(Caenorhabditis elegans)
Burnham Center For Chemical Genomics
Curated by PubChem BioAssay
LigandPNGBDBM93750(4-{5-[3-(2,4-Dichloro-phenoxy)-propyl]-[1,2,4]oxad...)
Affinity DataIC50:  2.95E+4nM
In DepthDetails PCBioAssay