BDBM93774 2-chloranyl-5-[(4-chloranylphenoxy)methyl]-1,3-thiazole::2-chloro-5-[(4-chlorophenoxy)methyl]-1,3-thiazole::2-chloro-5-[(4-chlorophenoxy)methyl]thiazole::4-chlorophenyl (2-chloro-1,3-thiazol-5-yl)methyl ether::MLS000327202::SMR000179766::cid_3379732
SMILES Clc1ncc(COc2ccc(Cl)cc2)s1
InChI Key InChIKey=UQMJQKRHTZOCNO-UHFFFAOYSA-N
Data  2 IC50
  Tab Delimited (TSV)   2D SDfile   Computed 3D by Vconf -m prep SDfile
Find this compound or compounds like it in BindingDB:
Activity Spreadsheet -- Enzyme Inhibition Constant Data from BindingDB
Found 2 hits for monomerid = 93774
TargetHeat shock protein hsp-16.2(Caenorhabditis elegans)
Burnham Center For Chemical Genomics
Curated by PubChem BioAssay
LigandPNGBDBM93774(2-chloranyl-5-[(4-chloranylphenoxy)methyl]-1,3-thi...)
Affinity DataIC50: >6.40E+4nM
In DepthDetails PCBioAssay
TargetProtein skinhead-1(Caenorhabditis elegans)
Burnham Center For Chemical Genomics
Curated by PubChem BioAssay
LigandPNGBDBM93774(2-chloranyl-5-[(4-chloranylphenoxy)methyl]-1,3-thi...)
Affinity DataIC50:  2.31E+4nM
In DepthDetails PCBioAssay