BDBM93926 4-[(4-aminophenyl)-(4-azanylidenecyclohexa-2,5-dien-1-ylidene)methyl]aniline::4-[(4-aminophenyl)-(4-imino-1-cyclohexa-2,5-dienylidene)methyl]aniline::4-[(4-aminophenyl)-(4-iminocyclohexa-2,5-dien-1-ylidene)methyl]aniline::MLS002701900::SMR001565485::[4-[(4-aminophenyl)-(4-iminocyclohexa-2,5-dien-1-ylidene)methyl]phenyl]amine::cid_11293
SMILES [#7]-c1ccc(cc1)-[#6](=[#6]-1/[#6]=[#6]-[#6](=[#7])-[#6]=[#6]-1)\c1ccc(-[#7])cc1
InChI Key InChIKey=AFAIELJLZYUNPW-UHFFFAOYSA-N
Data  2 IC50
  Tab Delimited (TSV)   2D SDfile   Computed 3D by Vconf -m prep SDfile
Find this compound or compounds like it in BindingDB:
Activity Spreadsheet -- Enzyme Inhibition Constant Data from BindingDB
Found 2 hits for monomerid = 93926
TargetHeat shock protein hsp-16.2(Caenorhabditis elegans)
Burnham Center For Chemical Genomics
Curated by PubChem BioAssay
LigandPNGBDBM93926(4-[(4-aminophenyl)-(4-azanylidenecyclohexa-2,5-die...)
Affinity DataIC50: >6.40E+4nM
In DepthDetails PCBioAssay
TargetProtein skinhead-1(Caenorhabditis elegans)
Burnham Center For Chemical Genomics
Curated by PubChem BioAssay
LigandPNGBDBM93926(4-[(4-aminophenyl)-(4-azanylidenecyclohexa-2,5-die...)
Affinity DataIC50:  2.02E+4nM
In DepthDetails PCBioAssay