BDBM94155 4-[(3,5-dimethyl-1,2-oxazol-4-yl)methoxy]-N-(3-methylphenyl)benzamide::4-[(3,5-dimethyl-4-isoxazolyl)methoxy]-N-(3-methylphenyl)benzamide::4-[(3,5-dimethylisoxazol-4-yl)methoxy]-N-(m-tolyl)benzamide::MLS002158086::SMR001240562::cid_2476863
SMILES Cc1noc(C)c1COc1ccc(cc1)C(=O)Nc1cccc(C)c1
InChI Key InChIKey=JFIOBYNQEPXSHL-UHFFFAOYSA-N
Data  1 IC50
  Tab Delimited (TSV)   2D SDfile   Computed 3D by Vconf -m prep SDfile
Find this compound or compounds like it in BindingDB:
Activity Spreadsheet -- Enzyme Inhibition Constant Data from BindingDB
Found 1 hit for monomerid = 94155
TargetNeuropilin-1(Homo sapiens (Human))
Burnham Center For Chemical Genomics
Curated by PubChem BioAssay
LigandPNGBDBM94155(4-[(3,5-dimethyl-1,2-oxazol-4-yl)methoxy]-N-(3-met...)
Affinity DataIC50: >9.50E+4nM
In DepthDetails PCBioAssay