BDBM94832 MLS001175676::N-(2-fluorobenzyl)-2-methyl-cinchoninamide::N-[(2-fluorophenyl)methyl]-2-methyl-4-quinolinecarboxamide::N-[(2-fluorophenyl)methyl]-2-methyl-quinoline-4-carboxamide::N-[(2-fluorophenyl)methyl]-2-methylquinoline-4-carboxamide::SMR000594984::cid_4799535
SMILES Cc1cc(C(=O)NCc2ccccc2F)c2ccccc2n1
InChI Key InChIKey=DGERMYOLUBBSED-UHFFFAOYSA-N
Data  2 IC50
  Tab Delimited (TSV)   2D SDfile   Computed 3D by Vconf -m prep SDfile
Find this compound or compounds like it in BindingDB:
Activity Spreadsheet -- Enzyme Inhibition Constant Data from BindingDB
Found 2 hits for monomerid = 94832
TargetSentrin-specific protease 1(Homo sapiens (Human))
Burnham Center For Chemical Genomics
Curated by PubChem BioAssay
LigandPNGBDBM94832(MLS001175676 | N-(2-fluorobenzyl)-2-methyl-cinchon...)
Affinity DataIC50:  1.79E+4nM
In DepthDetails PCBioAssay
TargetSentrin-specific protease 1(Homo sapiens (Human))
Burnham Center For Chemical Genomics
Curated by PubChem BioAssay
LigandPNGBDBM94832(MLS001175676 | N-(2-fluorobenzyl)-2-methyl-cinchon...)
Affinity DataIC50:  1.08E+4nM
In DepthDetails PCBioAssay