BDBM95306 (6-oxidanylidenebenzo[c]chromen-3-yl) phenyl carbonate::(6-oxobenzo[c]chromen-3-yl) phenyl carbonate::Carbonic acid 6-oxo-6H-benzo[c]chromen-3-yl ester phenyl ester::MLS002536805::SMR000175478::carbonic acid (6-ketobenzo[c]chromen-3-yl) phenyl ester::carbonic acid (6-oxo-3-benzo[c][1]benzopyranyl) phenyl ester::cid_692203
SMILES O=C(Oc1ccccc1)Oc1ccc2c(c1)oc(=O)c1ccccc21
InChI Key InChIKey=GRZFLTREEADAON-UHFFFAOYSA-N
Data  3 IC50
  Tab Delimited (TSV)   2D SDfile   Computed 3D by Vconf -m prep SDfile
Find this compound or compounds like it in BindingDB:
Activity Spreadsheet -- Enzyme Inhibition Constant Data from BindingDB
Found 3 hits for monomerid = 95306
TargetEnvelope glycoprotein gp160(Human immunodeficiency virus type 1 group M subtyp...)
The Scripps Research Institute Molecular Screening Center
Curated by PubChem BioAssay
LigandPNGBDBM95306((6-oxidanylidenebenzo[c]chromen-3-yl) phenyl carbo...)
Affinity DataIC50:  2.51E+4nM
In DepthDetails PCBioAssay
TargetEnvelope glycoprotein gp160(Human immunodeficiency virus type 1 group M subtyp...)
The Scripps Research Institute Molecular Screening Center
Curated by PubChem BioAssay
LigandPNGBDBM95306((6-oxidanylidenebenzo[c]chromen-3-yl) phenyl carbo...)
Affinity DataIC50:  4.13E+3nM
In DepthDetails PCBioAssay
TargetEnvelope glycoprotein gp160(Human immunodeficiency virus type 1 group M subtyp...)
The Scripps Research Institute Molecular Screening Center
Curated by PubChem BioAssay
LigandPNGBDBM95306((6-oxidanylidenebenzo[c]chromen-3-yl) phenyl carbo...)
Affinity DataIC50:  2.50E+3nM
In DepthDetails PCBioAssay