BDBM96629 2-(4-Chloro-phenyl)-1H-imidazo[4,5-c]pyridine::2-(4-chlorophenyl)-3H-imidazo[4,5-c]pyridine::MLS000550832::SMR000174680::cid_153617
SMILES Clc1ccc(cc1)-c1nc2ccncc2[nH]1
InChI Key InChIKey=RBDQHKDYQDAOJG-UHFFFAOYSA-N
Data  2 IC50  2 EC50
  Tab Delimited (TSV)   2D SDfile   Computed 3D by Vconf -m prep SDfile
Find this compound or compounds like it in BindingDB:
Activity Spreadsheet -- Enzyme Inhibition Constant Data from BindingDB
Found 4 hits for monomerid = 96629
TargetGuanine nucleotide-binding protein subunit alpha-15(Homo sapiens (Human))
The Scripps Research Institute Molecular Screening Center
Curated by PubChem BioAssay
LigandPNGBDBM96629(2-(4-Chloro-phenyl)-1H-imidazo[4,5-c]pyridine | 2-...)
Affinity DataEC50: >2.99E+4nM
In DepthDetails PCBioAssay
TargetGuanine nucleotide-binding protein subunit alpha-15(Homo sapiens (Human))
The Scripps Research Institute Molecular Screening Center
Curated by PubChem BioAssay
LigandPNGBDBM96629(2-(4-Chloro-phenyl)-1H-imidazo[4,5-c]pyridine | 2-...)
Affinity DataIC50: >2.99E+4nM
In DepthDetails PCBioAssay
TargetTrace amine-associated receptor 1(Homo sapiens (Human))
The Scripps Research Institute Molecular Screening Center
Curated by PubChem BioAssay
LigandPNGBDBM96629(2-(4-Chloro-phenyl)-1H-imidazo[4,5-c]pyridine | 2-...)
Affinity DataEC50: >2.99E+4nM
In DepthDetails PCBioAssay
TargetTrace amine-associated receptor 1(Homo sapiens (Human))
The Scripps Research Institute Molecular Screening Center
Curated by PubChem BioAssay
LigandPNGBDBM96629(2-(4-Chloro-phenyl)-1H-imidazo[4,5-c]pyridine | 2-...)
Affinity DataIC50: >2.99E+4nM
In DepthDetails PCBioAssay