Target
Ataxin-1
Ligand
BDBM511530
Substrate
Meas. Tech.
Human ATX Enzyme Inhibition Assay
IC50
1.000±n/a nM
Citation
 Mattei, PHert, JHunziker, DRudolph, MSchmitz, PDi Giorgio, PGomme, J Heterocyclic compounds useful as dual ATX/CA inhibitors US Patent  US11059794 Publication Date 7/13/2021 
Target
Name:
Ataxin-1
Synonyms:
ATX1 ATXN1 | SCA1
Type:
Protein
Mol. Mass.:
86941.25
Organism:
Homo sapiens (Human)
Description:
P54253
Residue:
815
  
Inhibitor
Name:
BDBM511530
Synonyms:
4-(piperidin-4- ylmethyl)benzenesulfonamide hydrochloride (CAS-RN 333986-77-9)/2-cyclopropyl- 6-(oxan-4-ylmethoxy)pyridine- 4-carboxylic acid (CAS-RN 1810776-23-8) | US11059794, Example 5.03
Type:
Small organic molecule
Emp. Form.:
C27H35N3O5S
Mol. Mass.:
513.649
SMILES:
NS(=O)(=O)c1ccc(CC2CCN(CC2)C(=O)c2cc(OCC3CCOCC3)nc(c2)C2CC2)cc1
: