Target
Ataxin-1
Ligand
BDBM511541
Substrate
Meas. Tech.
Human ATX Enzyme Inhibition Assay
IC50
1.000±n/a nM
Citation
 Mattei, PHert, JHunziker, DRudolph, MSchmitz, PDi Giorgio, PGomme, J Heterocyclic compounds useful as dual ATX/CA inhibitors US Patent  US11059794 Publication Date 7/13/2021 
Target
Name:
Ataxin-1
Synonyms:
ATX1 ATXN1 | SCA1
Type:
Protein
Mol. Mass.:
86941.25
Organism:
Homo sapiens (Human)
Description:
P54253
Residue:
815
  
Inhibitor
Name:
BDBM511541
Synonyms:
US11059794, Example 6.03 | tert-butyl 4-[2-(2,3-difluoro-4- sulfamoylphenyl)sulfonylethyl]- piperidine-1-carboxylate (intermediate 15.3)/2-cyclopropyl- 6-(oxan-4-ylmethoxy)pyridine-4- carboxylic acid (CAS-RN 1810776- 23-8)
Type:
Small organic molecule
Emp. Form.:
C26H29F5N6O5S2
Mol. Mass.:
664.668
SMILES:
Cc1nnn(Cc2cc(ccc2CCC(=O)N2CCC(CCS(=O)(=O)c3ccc(c(F)c3F)S(N)(=O)=O)CC2)C(F)(F)F)n1
: