Target
Ataxin-1
Ligand
BDBM511551
Substrate
Meas. Tech.
Human ATX Enzyme Inhibition Assay
IC50
1.000±n/a nM
Citation
 Mattei, PHert, JHunziker, DRudolph, MSchmitz, PDi Giorgio, PGomme, J Heterocyclic compounds useful as dual ATX/CA inhibitors US Patent  US11059794 Publication Date 7/13/2021 
Target
Name:
Ataxin-1
Synonyms:
ATX1 ATXN1 | SCA1
Type:
Protein
Mol. Mass.:
86941.25
Organism:
Homo sapiens (Human)
Description:
P54253
Residue:
815
  
Inhibitor
Name:
BDBM511551
Synonyms:
US11059794, Example 6.13 | tert-butyl 4-(2-fluoro-4- sulfamoylphenyl)sulfinylpiperidine- 1-carboxylate (intermediate 10)/3- [2-[(5-methyltetrazol-2-yl)methyl]- 4- (trifluoromethyl)phenyl]propanoic acid (CAS-RN 1646783-83-6)
Type:
Small organic molecule
Emp. Form.:
C24H26F4N6O4S2
Mol. Mass.:
602.625
SMILES:
Cc1nnn(Cc2cc(ccc2CCC(=O)N2CCC(CC2)S(=O)c2ccc(cc2F)S(N)(=O)=O)C(F)(F)F)n1
: