Target
Ataxin-1
Ligand
BDBM511567
Substrate
Meas. Tech.
Human ATX Enzyme Inhibition Assay
IC50
1.000±n/a nM
Citation
 Mattei, PHert, JHunziker, DRudolph, MSchmitz, PDi Giorgio, PGomme, J Heterocyclic compounds useful as dual ATX/CA inhibitors US Patent  US11059794 Publication Date 7/13/2021 
Target
Name:
Ataxin-1
Synonyms:
ATX1 ATXN1 | SCA1
Type:
Protein
Mol. Mass.:
86941.25
Organism:
Homo sapiens (Human)
Description:
P54253
Residue:
815
  
Inhibitor
Name:
BDBM511567
Synonyms:
US11059794, Example 6.27 | tert-butyl 4-(2,3-difluoro-4- sulfamoylphenyl)sulfonylpiperidine- 1-carboxylate (intermediate 15)/2- cyclopropyl-6-(oxan-4- ylmethoxy)pyridine-4-carboxylic acid (CAS-RN 1810776-23-8)
Type:
Small organic molecule
Emp. Form.:
C26H31F2N3O7S2
Mol. Mass.:
599.667
SMILES:
NS(=O)(=O)c1ccc(c(F)c1F)S(=O)(=O)C1CCN(CC1)C(=O)c1cc(OCC2CCOCC2)nc(c1)C1CC1
: