Target
Cathepsin D
Ligand
BDBM8021
Substrate
Peptide Substrate
Meas. Tech.
Enzyme Inhibition Measurements
pH
4.5±n/a
Temperature
310.15±n/a K
Ki
>2000±n/a nM
Citation
 Noteberg, DHamelink, EHulten, JWahlgren, MVrang, LSamuelsson, BHallberg, A Design and synthesis of plasmepsin I and plasmepsin II inhibitors with activity in Plasmodium falciparum-infected cultured human erythrocytes. J Med Chem 46:734-46 (2003)  
Target
Name:
Cathepsin D
Synonyms:
CATD_HUMAN CTSD Cathepsin D heavy chain Cathepsin D precursor
Type:
Enzyme
Mol. Mass.:
44551.72
Organism:
Homo sapiens (Human)
Description:
Human proCathepsin D (SwissProt accession number P07339) was expressed in Sf9 cells, purified, and autoactivated.
Residue:
412
  
Inhibitor
Name:
BDBM8021
Synonyms:
(2S)-2-{[(2S,3S)-2-hydroxy-3-[(2S)-3-methyl-2-(pyridin-2-ylformamido)butanamido]-4-phenylbutyl]amino}-4-methylpentanamide hydroxyethylamine-based inhibitor 11b
Type:
Small organic molecule
Emp. Form.:
C27H39N5O4
Mol. Mass.:
497.6297
SMILES:
CC(C)C[C@H](NC[C@H](O)[C@H](Cc1ccccc1)NC(=O)[C@@H](NC(=O)c1ccccn1)C(C)C)C(N)=O
:
Substrate
Name:
Peptide Substrate
Synonyms:
Type:
Peptide
Mol. Mass.:
3501.67
Organism:
Description:
Residue:
31