Target
Cathepsin D
Ligand
BDBM8024
Substrate
Peptide Substrate
Meas. Tech.
Enzyme Inhibition Measurements
pH
4.5±n/a
Temperature
310.15±n/a K
Ki
>2000±n/a nM
Citation
 Noteberg, DHamelink, EHulten, JWahlgren, MVrang, LSamuelsson, BHallberg, A Design and synthesis of plasmepsin I and plasmepsin II inhibitors with activity in Plasmodium falciparum-infected cultured human erythrocytes. J Med Chem 46:734-46 (2003)  
Target
Name:
Cathepsin D
Synonyms:
CATD_HUMAN CTSD Cathepsin D heavy chain Cathepsin D precursor
Type:
Enzyme
Mol. Mass.:
44551.72
Organism:
Homo sapiens (Human)
Description:
Human proCathepsin D (SwissProt accession number P07339) was expressed in Sf9 cells, purified, and autoactivated.
Residue:
412
  
Inhibitor
Name:
BDBM8024
Synonyms:
(2R,5S,6R)-3-Aza-2-benzyl-5-hydroxy-7-phenyl-6-[(picolyl-L-valinyl)amino]heptanoyl Amide hydroxyethylamine-based inhibitor 11e
Type:
Small organic molecule
Emp. Form.:
C30H37N5O4
Mol. Mass.:
531.6459
SMILES:
CC(C)[C@H](NC(=O)c1ccccn1)C(=O)N[C@@H](Cc1ccccc1)[C@@H](O)CN[C@H](Cc1ccccc1)C(N)=O
:
Substrate
Name:
Peptide Substrate
Synonyms:
Type:
Peptide
Mol. Mass.:
3501.67
Organism:
Description:
Residue:
31