Target
Replicase polyprotein 1ab
Ligand
BDBM46667
Substrate
Meas. Tech.
Various Assay
IC50
490±n/a nM
Citation
 Gao, KWang, RChen, JTepe, JJHuang, FWei, GW Perspectives on SARS-CoV-2 Main Protease Inhibitors. J Med Chem 64:16922-16955 (2021)  
Target
Name:
Replicase polyprotein 1ab
Synonyms:
ORF1ab polyprotein pp1ab | rep
Type:
Protein
Mol. Mass.:
794070.71
Organism:
2019-nCoV
Description:
P0DTD1
Residue:
7096
  
Inhibitor
Name:
BDBM46667
Synonyms:
2-phenyl-1,2-benzothiazol-3-one MLS-0107957.0001 cid_164981
Type:
Small organic molecule
Emp. Form.:
C13H9NOS
Mol. Mass.:
227.282
SMILES:
O=c1n(sc2ccccc12)-c1ccccc1
: