Target
Replicase polyprotein 1ab
Ligand
BDBM50188384
Substrate
Meas. Tech.
Various Assay
IC50
41800±n/a nM
Citation
 Gao, KWang, RChen, JTepe, JJHuang, FWei, GW Perspectives on SARS-CoV-2 Main Protease Inhibitors. J Med Chem 64:16922-16955 (2021)  
Target
Name:
Replicase polyprotein 1ab
Synonyms:
ORF1ab polyprotein pp1ab | rep
Type:
Protein
Mol. Mass.:
794070.71
Organism:
2019-nCoV
Description:
P0DTD1
Residue:
7096
  
Inhibitor
Name:
BDBM50188384
Synonyms:
1-butyl-5-iodoindoline-2,3-dione acs.jmedchem.1c00409_ST.725
Type:
Small organic molecule
Emp. Form.:
C12H12INO2
Mol. Mass.:
329.1337
SMILES:
CCCCN1C(=O)C(=O)c2cc(I)ccc12
: