Target
Myeloperoxidase
Ligand
BDBM513876
Substrate
Meas. Tech.
MPO Peroxidation Assay (Amplex Red Assay)
IC50
550±n/a nM
Citation
 Smallheer, JMHu, CHValente, MNShaw, SAVokits, BPHalpern, OS Triazolopyridine inhibitors of myeloperoxidase US Patent  US11059818 Publication Date 7/13/2021 
Target
Name:
Myeloperoxidase
Synonyms:
84 kDa myeloperoxidase MPO Myeloperoxidase Myeloperoxidase heavy chain PERM_HUMAN
Type:
Enzyme
Mol. Mass.:
83888.32
Organism:
Homo sapiens (Human)
Description:
P05164
Residue:
745
  
Inhibitor
Name:
BDBM513876
Synonyms:
US11059818, Example 2
Type:
Small organic molecule
Emp. Form.:
C22H26N8
Mol. Mass.:
402.4954
SMILES:
CCCC(c1cnn(Cc2ccc3CNCCc3c2)c1)c1cc(N)nc2[nH]nnc12
: