Target
Myeloperoxidase
Ligand
BDBM513877
Substrate
Meas. Tech.
MPO Chlorination Assay (APF Assay)
IC50
550±n/a nM
Citation
 Smallheer, JMHu, CHValente, MNShaw, SAVokits, BPHalpern, OS Triazolopyridine inhibitors of myeloperoxidase US Patent  US11059818 Publication Date 7/13/2021 
Target
Name:
Myeloperoxidase
Synonyms:
84 kDa myeloperoxidase MPO Myeloperoxidase Myeloperoxidase heavy chain PERM_HUMAN
Type:
Enzyme
Mol. Mass.:
83888.32
Organism:
Homo sapiens (Human)
Description:
P05164
Residue:
745
  
Inhibitor
Name:
BDBM513877
Synonyms:
US11059818, Example 3
Type:
Small organic molecule
Emp. Form.:
C20H22N8
Mol. Mass.:
374.4423
SMILES:
CC(c1cnn(Cc2ccc3CNCCc3c2)c1)c1cc(N)nc2[nH]nnc12
: