Target
Myeloperoxidase
Ligand
BDBM513881
Substrate
Meas. Tech.
MPO Chlorination Assay (APF Assay)
IC50
50±n/a nM
Citation
 Smallheer, JMHu, CHValente, MNShaw, SAVokits, BPHalpern, OS Triazolopyridine inhibitors of myeloperoxidase US Patent  US11059818 Publication Date 7/13/2021 
Target
Name:
Myeloperoxidase
Synonyms:
84 kDa myeloperoxidase MPO Myeloperoxidase Myeloperoxidase heavy chain PERM_HUMAN
Type:
Enzyme
Mol. Mass.:
83888.32
Organism:
Homo sapiens (Human)
Description:
P05164
Residue:
745
  
Inhibitor
Name:
BDBM513881
Synonyms:
US11059818, Example 7
Type:
Small organic molecule
Emp. Form.:
C32H32N8
Mol. Mass.:
528.6501
SMILES:
Nc1cc(C(CCCc2ccc3ccccc3c2)c2cnn(Cc3ccc4CNCCc4c3)c2)c2nn[nH]c2n1
: