Target
Myeloperoxidase
Ligand
BDBM513884
Substrate
Meas. Tech.
MPO Peroxidation Assay (Amplex Red Assay)
IC50
550±n/a nM
Citation
 Smallheer, JMHu, CHValente, MNShaw, SAVokits, BPHalpern, OS Triazolopyridine inhibitors of myeloperoxidase US Patent  US11059818 Publication Date 7/13/2021 
Target
Name:
Myeloperoxidase
Synonyms:
84 kDa myeloperoxidase MPO Myeloperoxidase Myeloperoxidase heavy chain PERM_HUMAN
Type:
Enzyme
Mol. Mass.:
83888.32
Organism:
Homo sapiens (Human)
Description:
P05164
Residue:
745
  
Inhibitor
Name:
BDBM513884
Synonyms:
US11059818, Example 10
Type:
Small organic molecule
Emp. Form.:
C26H32N8O
Mol. Mass.:
472.5853
SMILES:
Nc1cc(C(CCC2CCOCC2)c2cnn(Cc3ccc4CNCCc4c3)c2)c2nn[nH]c2n1
: