Target
Myeloperoxidase
Ligand
BDBM513901
Substrate
Meas. Tech.
MPO Chlorination Assay (APF Assay)
IC50
50±n/a nM
Citation
 Smallheer, JMHu, CHValente, MNShaw, SAVokits, BPHalpern, OS Triazolopyridine inhibitors of myeloperoxidase US Patent  US11059818 Publication Date 7/13/2021 
Target
Name:
Myeloperoxidase
Synonyms:
84 kDa myeloperoxidase MPO Myeloperoxidase Myeloperoxidase heavy chain PERM_HUMAN
Type:
Enzyme
Mol. Mass.:
83888.32
Organism:
Homo sapiens (Human)
Description:
P05164
Residue:
745
  
Inhibitor
Name:
BDBM513901
Synonyms:
7-{1-[1-(3,3-Difluorocyclopentyl)-1H-pyrazol-4-yl]-3-{[trans-4-phenylcyclohexyl]amino}propyl}-3H-[1,2,3]triazolo[4,5-b]pyridin-5-amine, 2TFA | US11059818, Example 27
Type:
Small organic molecule
Emp. Form.:
C8H9IN2O
Mol. Mass.:
276.0743
SMILES:
Ic1cnn(c1)C1CCC(=O)C1
: