Target
Myeloperoxidase
Ligand
BDBM513905
Substrate
Meas. Tech.
MPO Chlorination Assay (APF Assay)
IC50
50±n/a nM
Citation
 Smallheer, JMHu, CHValente, MNShaw, SAVokits, BPHalpern, OS Triazolopyridine inhibitors of myeloperoxidase US Patent  US11059818 Publication Date 7/13/2021 
Target
Name:
Myeloperoxidase
Synonyms:
84 kDa myeloperoxidase MPO Myeloperoxidase Myeloperoxidase heavy chain PERM_HUMAN
Type:
Enzyme
Mol. Mass.:
83888.32
Organism:
Homo sapiens (Human)
Description:
P05164
Residue:
745
  
Inhibitor
Name:
BDBM513905
Synonyms:
US11059818, Example 31
Type:
Small organic molecule
Emp. Form.:
C31H33F3N8
Mol. Mass.:
574.6425
SMILES:
Nc1cc(C(CCN[C@H]2CC[C@@H](CC2)c2ccccc2)c2cnn(Cc3cccc(c3)C(F)(F)F)c2)c2nn[nH]c2n1
: