Target
Myeloperoxidase
Ligand
BDBM513909
Substrate
Meas. Tech.
MPO Chlorination Assay (APF Assay)
IC50
50±n/a nM
Citation
 Smallheer, JMHu, CHValente, MNShaw, SAVokits, BPHalpern, OS Triazolopyridine inhibitors of myeloperoxidase US Patent  US11059818 Publication Date 7/13/2021 
Target
Name:
Myeloperoxidase
Synonyms:
84 kDa myeloperoxidase MPO Myeloperoxidase Myeloperoxidase heavy chain PERM_HUMAN
Type:
Enzyme
Mol. Mass.:
83888.32
Organism:
Homo sapiens (Human)
Description:
P05164
Residue:
745
  
Inhibitor
Name:
BDBM513909
Synonyms:
US11059818, Example 34
Type:
Small organic molecule
Emp. Form.:
C25H29N7
Mol. Mass.:
427.5447
SMILES:
Nc1cc(C(CCN[C@H]2CC[C@@H](CC2)c2ccccc2)c2cccnc2)c2nn[nH]c2n1
: