Target
Myeloperoxidase
Ligand
BDBM513916
Substrate
Meas. Tech.
MPO Peroxidation Assay (Amplex Red Assay)
IC50
50±n/a nM
Citation
 Smallheer, JMHu, CHValente, MNShaw, SAVokits, BPHalpern, OS Triazolopyridine inhibitors of myeloperoxidase US Patent  US11059818 Publication Date 7/13/2021 
Target
Name:
Myeloperoxidase
Synonyms:
84 kDa myeloperoxidase MPO Myeloperoxidase Myeloperoxidase heavy chain PERM_HUMAN
Type:
Enzyme
Mol. Mass.:
83888.32
Organism:
Homo sapiens (Human)
Description:
P05164
Residue:
745
  
Inhibitor
Name:
BDBM513916
Synonyms:
US11059818, Example 41
Type:
Small organic molecule
Emp. Form.:
C34H40N8O2
Mol. Mass.:
592.7338
SMILES:
Nc1cc(C(CCN(CCO)C23CCC(CC2)(CC3)c2ccccc2)c2ccn(Cc3cccc(O)c3)n2)c2nn[nH]c2n1
: