Target
Myeloperoxidase
Ligand
BDBM513917
Substrate
Meas. Tech.
MPO Chlorination Assay (APF Assay)
IC50
50±n/a nM
Citation
 Smallheer, JMHu, CHValente, MNShaw, SAVokits, BPHalpern, OS Triazolopyridine inhibitors of myeloperoxidase US Patent  US11059818 Publication Date 7/13/2021 
Target
Name:
Myeloperoxidase
Synonyms:
84 kDa myeloperoxidase MPO Myeloperoxidase Myeloperoxidase heavy chain PERM_HUMAN
Type:
Enzyme
Mol. Mass.:
83888.32
Organism:
Homo sapiens (Human)
Description:
P05164
Residue:
745
  
Inhibitor
Name:
BDBM513917
Synonyms:
US11059818, Example 42
Type:
Small organic molecule
Emp. Form.:
C30H34N8O2
Mol. Mass.:
538.6434
SMILES:
Nc1cc(C(CCN[C@H]2C[C@@H](O)[C@H](Cc3ccccc3)C2)c2cnn(Cc3cccc(O)c3)c2)c2nn[nH]c2n1
: