Target
Tyrosine-protein kinase JAK1 [861-1152]
Ligand
BDBM173997
Substrate
Meas. Tech.
JAK1 Kinase Assay
IC50
167±n/a nM
Citation
 Brasca, MGBindi, SCaldarelli, MNesi, MOrrenius, SCPanzeri, A Substituted pyrroles active as kinases inhibitors US Patent  US9688661 Publication Date 6/27/2017 
Target
Name:
Tyrosine-protein kinase JAK1 [861-1152]
Synonyms:
JAK1 JAK1B Tyrosine-protein kinase JAK1 (JAK1)
Type:
Protein
Mol. Mass.:
33439.94
Organism:
Homo sapiens (Human)
Description:
Human JAK1 variant (861-1152 aa)
Residue:
292
  
Inhibitor
Name:
BDBM173997
Synonyms:
US9688661, 5-(6-Aminopyrimidin-4-yl)-2-[2-chloro-5-(trifluoromethyl)phenyl]-1H-pyrrole-3-carboxamide (compd 204)
Type:
Small organic molecule
Emp. Form.:
C16H10ClF3N5O
Mol. Mass.:
380.732
SMILES:
NC(=O)c1cc(nc1-c1cc(ccc1Cl)C(F)(F)F)-c1cc(N)ncn1
: