Target
Tyrosine-protein kinase JAK1 [861-1152]
Ligand
BDBM174007
Substrate
Meas. Tech.
JAK1 Kinase Assay
IC50
14±n/a nM
Citation
 Brasca, MGBindi, SCaldarelli, MNesi, MOrrenius, SCPanzeri, A Substituted pyrroles active as kinases inhibitors US Patent  US9688661 Publication Date 6/27/2017 
Target
Name:
Tyrosine-protein kinase JAK1 [861-1152]
Synonyms:
JAK1 JAK1B Tyrosine-protein kinase JAK1 (JAK1)
Type:
Protein
Mol. Mass.:
33439.94
Organism:
Homo sapiens (Human)
Description:
Human JAK1 variant (861-1152 aa)
Residue:
292
  
Inhibitor
Name:
BDBM174007
Synonyms:
US9688661, 2-[2-Ethyl-5-(trifluoromethyl)phenyl]-5-[6-(methylamino)pyrimidin-4-yl]-1H-pyrrole-3-carboxamide (compd 219)
Type:
Small organic molecule
Emp. Form.:
C19H17F3N5O
Mol. Mass.:
388.3664
SMILES:
CCc1ccc(cc1-c1nc(cc1C(N)=O)-c1cc(NC)ncn1)C(F)(F)F
: