Target
Tyrosine-protein kinase JAK1 [861-1152]
Ligand
BDBM174034
Substrate
Meas. Tech.
JAK1 Kinase Assay
IC50
9.00±n/a nM
Citation
 Brasca, MGBindi, SCaldarelli, MNesi, MOrrenius, SCPanzeri, A Substituted pyrroles active as kinases inhibitors US Patent  US9688661 Publication Date 6/27/2017 
Target
Name:
Tyrosine-protein kinase JAK1 [861-1152]
Synonyms:
JAK1 JAK1B Tyrosine-protein kinase JAK1 (JAK1)
Type:
Protein
Mol. Mass.:
33439.94
Organism:
Homo sapiens (Human)
Description:
Human JAK1 variant (861-1152 aa)
Residue:
292
  
Inhibitor
Name:
BDBM174034
Synonyms:
US9688661, 5-(6-Aminopyrimidin-4-yl)-2-[2-ethyl-5-(trifluoromethyl)phenyl]-N-methyl-1H-pyrrole-3-carboxamide (compd 321)
Type:
Small organic molecule
Emp. Form.:
C19H18F3N5O
Mol. Mass.:
389.3743
SMILES:
CCc1ccc(cc1-c1c(cc(-c2cc(N)ncn2)n1C)C(N)=O)C(F)(F)F
: