Target
N-formyl peptide receptor 2
Ligand
BDBM517780
Substrate
Meas. Tech.
FPR2 and FPR1 Cyclic Adenosine Monophosphate (cAMP) Assays
EC50
0.170±n/a nM
Citation
 Shirude, PSChattopadhyay, AKWurtz, NR Aryl heterocyclic piperidinone formyl peptide 2 receptor and formyl peptide 1 receptor agonists US Patent  US11124494 Publication Date 9/21/2021 
Target
Name:
N-formyl peptide receptor 2
Synonyms:
ALXR, FPRL1, FPR2 FPR2 FPRH1 Formyl Peptide Receptor-Like 1 LXA4 receptor Lipoxin A4 receptor RFP | hFPRL
Type:
G Protein-Coupled Receptor (GPCR)
Mol. Mass.:
38968.35
Organism:
Homo sapiens (Human)
Description:
P25090
Residue:
351
  
Inhibitor
Name:
BDBM517780
Synonyms:
US11124494, Example 18
Type:
Small organic molecule
Emp. Form.:
C24H26F4N4O4S
Mol. Mass.:
542.546
SMILES:
CS(=O)(=O)NCC1(CC1)c1ccc(cc1F)N1CCC[C@@H](NC(=O)Nc2ccc(cc2)C(F)(F)F)C1=O
: