Target
Glycogen synthase kinase-3 beta
Ligand
BDBM188502
Substrate
Meas. Tech.
Secondary Surface Plasmon Resonance Affinity Determination
Kd
550±n/a nM
Citation
 Wagner, FFPan, JQDandapani, SGermain, AHolson, EMunoz, BNag, PPLewis, MCHaggarty, SJBishop, JAStegmaier, KWeiwer, MBanerji, V Kinase inhibitors and methods of use thereof US Patent  US10137122 Publication Date 11/27/2018 
Target
Name:
Glycogen synthase kinase-3 beta
Synonyms:
GSK-3 beta GSK3B Glycogen synthase kinase 3 beta (GSK3B) Glycogen synthase kinase-3 beta (GSK-3B) Glycogen synthase kinase-3 beta (GSK3B) Glycogen synthase kinase-3beta (GSK3B) | Serine/threonine-protein kinase GSK3B
Type:
Enzyme
Mol. Mass.:
46756.38
Organism:
Homo sapiens (Human)
Description:
P49841
Residue:
420
  
Inhibitor
Name:
BDBM188502
Synonyms:
3,7,7-trimethyl-4-(pyridin-2-yl)-2,4,6,7,8,9-hexahydro-5H-pyrazolo[3,4-b]quinolin-5-one (5) | US10137122, Compound 36
Type:
Small organic molecule
Emp. Form.:
C18H20N4O
Mol. Mass.:
308.3776
SMILES:
Cc1[nH]nc2NC3=C(C(c12)c1ccccn1)C(=O)CC(C)(C)C3
: