Target
N-formyl peptide receptor 2
Ligand
BDBM450349
Substrate
Meas. Tech.
Biological Assay
EC50
0.270±n/a nM
Citation
 Shirude, PSBaligar, VSeshadri, BChattopadhyay, AKWurtz, NRKick, EK Phenylpyrrolidinone formyl peptide 2 receptor agonists US Patent  US11117861 Publication Date 9/14/2021 
Target
Name:
N-formyl peptide receptor 2
Synonyms:
ALXR, FPRL1, FPR2 FPR2 FPRH1 Formyl Peptide Receptor-Like 1 LXA4 receptor Lipoxin A4 receptor RFP | hFPRL
Type:
G Protein-Coupled Receptor (GPCR)
Mol. Mass.:
38968.35
Organism:
Homo sapiens (Human)
Description:
P25090
Residue:
351
  
Inhibitor
Name:
BDBM450349
Synonyms:
US10676431, Example 112 | US11117861, Example 112
Type:
Small organic molecule
Emp. Form.:
C26H24ClF3N3O4P
Mol. Mass.:
565.908
SMILES:
CP(C)(=O)c1ccccc1-c1ccc(N2[C@H](CO)C[C@@H](NC(=O)Nc3ccc(Cl)cc3F)C2=O)c(F)c1F
: