Target
D-amino-acid oxidase
Ligand
BDBM50431078
Substrate
Meas. Tech.
In Vitro Enzyme Assay
IC50
10.00±n/a nM
Citation
 Farnaby, WFieldhouse, CHazel, KKerr, CKinsella, NLivermore, DMerchant, KMiller, D Pyridazinone compounds and their use as DAAO inhibitors US Patent  US11129828 Publication Date 9/28/2021 
Target
Name:
D-amino-acid oxidase
Synonyms:
D-amino-acid oxidase (DAAO) DAMOX OXDA_HUMAN
Type:
Homodimer
Mol. Mass.:
39476.06
Organism:
Homo sapiens (Human)
Description:
P14920
Residue:
347
  
Inhibitor
Name:
BDBM50431078
Synonyms:
CHEMBL2338786 US11129828, Example 1 US9931340, Example 1
Type:
Small organic molecule
Emp. Form.:
C12H12N2O2
Mol. Mass.:
216.2359
SMILES:
Oc1cc(CCc2ccccc2)n[nH]c1=O
: